Project

General

Profile

RunControl installation output

bash$ curl -O https://pypi.python.org/packages/source/v/virtualenv/virtualenv-1.10.1.tar.gz
  % Total    % Received % Xferd  Average Speed   Time    Time     Time  Current
                                 Dload  Upload   Total   Spent    Left  Speed
100 1294k  100 1294k    0     0  5233k      0 --:--:-- --:--:-- --:--:-- 10.8M
bash$ tar xvfz virtualenv-1.10.1.tar.gz
virtualenv-1.10.1/
virtualenv-1.10.1/AUTHORS.txt
virtualenv-1.10.1/bin/
virtualenv-1.10.1/bin/rebuild-script.py
virtualenv-1.10.1/docs/
virtualenv-1.10.1/docs/_theme/
virtualenv-1.10.1/docs/_theme/nature/
virtualenv-1.10.1/docs/_theme/nature/static/
virtualenv-1.10.1/docs/_theme/nature/static/nature.css_t
virtualenv-1.10.1/docs/_theme/nature/static/pygments.css
virtualenv-1.10.1/docs/_theme/nature/theme.conf
virtualenv-1.10.1/docs/conf.py
virtualenv-1.10.1/docs/index.rst
virtualenv-1.10.1/docs/make.bat
virtualenv-1.10.1/docs/Makefile
virtualenv-1.10.1/docs/news.rst
virtualenv-1.10.1/LICENSE.txt
virtualenv-1.10.1/MANIFEST.in
virtualenv-1.10.1/PKG-INFO
virtualenv-1.10.1/README.rst
virtualenv-1.10.1/scripts/
virtualenv-1.10.1/scripts/virtualenv
virtualenv-1.10.1/setup.cfg
virtualenv-1.10.1/setup.py
virtualenv-1.10.1/virtualenv.egg-info/
virtualenv-1.10.1/virtualenv.egg-info/dependency_links.txt
virtualenv-1.10.1/virtualenv.egg-info/entry_points.txt
virtualenv-1.10.1/virtualenv.egg-info/not-zip-safe
virtualenv-1.10.1/virtualenv.egg-info/PKG-INFO
virtualenv-1.10.1/virtualenv.egg-info/SOURCES.txt
virtualenv-1.10.1/virtualenv.egg-info/top_level.txt
virtualenv-1.10.1/virtualenv.py
virtualenv-1.10.1/virtualenv_embedded/
virtualenv-1.10.1/virtualenv_embedded/activate.bat
virtualenv-1.10.1/virtualenv_embedded/activate.csh
virtualenv-1.10.1/virtualenv_embedded/activate.fish
virtualenv-1.10.1/virtualenv_embedded/activate.ps1
virtualenv-1.10.1/virtualenv_embedded/activate.sh
virtualenv-1.10.1/virtualenv_embedded/activate_this.py
virtualenv-1.10.1/virtualenv_embedded/deactivate.bat
virtualenv-1.10.1/virtualenv_embedded/distutils-init.py
virtualenv-1.10.1/virtualenv_embedded/distutils.cfg
virtualenv-1.10.1/virtualenv_embedded/site.py
virtualenv-1.10.1/virtualenv_support/
virtualenv-1.10.1/virtualenv_support/__init__.py
virtualenv-1.10.1/virtualenv_support/pip-1.4.1.tar.gz
virtualenv-1.10.1/virtualenv_support/setuptools-0.9.8.tar.gz
bash$ python virtualenv-1.10.1/virtualenv.py env
New python executable in env/bin/python
Installing Setuptools..............................................................................................................................................................................................................................done.
Installing Pip.....................................................................................................................................................................................................................................................................................................................................done.
bash$ source ./env/bin/activate
(env)bash$ cd lbnerc
(env)bash$ python ./setup.py develop
running develop
running egg_info
creating lbnerc.egg-info
writing requirements to lbnerc.egg-info/requires.txt
writing lbnerc.egg-info/PKG-INFO
writing top-level names to lbnerc.egg-info/top_level.txt
writing dependency_links to lbnerc.egg-info/dependency_links.txt
writing entry points to lbnerc.egg-info/entry_points.txt
writing manifest file 'lbnerc.egg-info/SOURCES.txt'
reading manifest file 'lbnerc.egg-info/SOURCES.txt'
writing manifest file 'lbnerc.egg-info/SOURCES.txt'
running build_ext
Creating /scratch/jcfree/daqarea/env/lib/python2.6/site-packages/lbnerc.egg-link (link to .)
Adding lbnerc 0.0.0 to easy-install.pth file
Installing uptimer script to /scratch/jcfree/daqarea/env/bin
Installing lbnerepl script to /scratch/jcfree/daqarea/env/bin
Installing lbnecomp script to /scratch/jcfree/daqarea/env/bin
Installing noisyexample script to /scratch/jcfree/daqarea/env/bin
Installing daqinterface script to /scratch/jcfree/daqarea/env/bin
Installing temps script to /scratch/jcfree/daqarea/env/bin
Installing lbnemoni script to /scratch/jcfree/daqarea/env/bin
Installing lbnecmd script to /scratch/jcfree/daqarea/env/bin
Installing lbnelog script to /scratch/jcfree/daqarea/env/bin
Installing lbnecontrol script to /scratch/jcfree/daqarea/env/bin
Installing lbnedbserv script to /scratch/jcfree/daqarea/env/bin
Installing hvcryo script to /scratch/jcfree/daqarea/env/bin
Installing tdu script to /scratch/jcfree/daqarea/env/bin

Installed /scratch/jcfree/daqarea/lbnerc
Processing dependencies for lbnerc==0.0.0
Searching for toolz==0.7.0
Reading https://pypi.python.org/simple/toolz/
Best match: toolz 0.7.0
Downloading https://pypi.python.org/packages/source/t/toolz/toolz-0.7.0.tar.gz#md5=85cb593e0ee192556b8ac901bc30a5ca
Processing toolz-0.7.0.tar.gz
Writing /tmp/easy_install-jznYzI/toolz-0.7.0/setup.cfg
Running toolz-0.7.0/setup.py -q bdist_egg --dist-dir /tmp/easy_install-jznYzI/toolz-0.7.0/egg-dist-tmp-6h6Tfi
Adding toolz 0.7.0 to easy-install.pth file

Installed /scratch/jcfree/daqarea/env/lib/python2.6/site-packages/toolz-0.7.0-py2.6.egg
Searching for psycopg2==2.5.4
Reading https://pypi.python.org/simple/psycopg2/
Best match: psycopg2 2.5.4
Downloading https://pypi.python.org/packages/source/p/psycopg2/psycopg2-2.5.4.tar.gz#md5=25216543a707eb33fd83aa8efb6e3f26
Processing psycopg2-2.5.4.tar.gz
Writing /tmp/easy_install-5m1XCf/psycopg2-2.5.4/setup.cfg
Running psycopg2-2.5.4/setup.py -q bdist_egg --dist-dir /tmp/easy_install-5m1XCf/psycopg2-2.5.4/egg-dist-tmp-0Anqim
zip_safe flag not set; analyzing archive contents...
psycopg2.tests.test_module: module references __file__
psycopg2.tests.test_types_basic: module references __file__
Adding psycopg2 2.5.4 to easy-install.pth file

Installed /scratch/jcfree/daqarea/env/lib/python2.6/site-packages/psycopg2-2.5.4-py2.6-linux-x86_64.egg
Searching for mysql-python==1.2.5
Reading https://pypi.python.org/simple/mysql-python/
Best match: MySQL-python 1.2.5
Downloading https://pypi.python.org/packages/source/M/MySQL-python/MySQL-python-1.2.5.zip#md5=654f75b302db6ed8dc5a898c625e030c
Processing MySQL-python-1.2.5.zip
Writing /tmp/easy_install-dvR53R/MySQL-python-1.2.5/setup.cfg
Running MySQL-python-1.2.5/setup.py -q bdist_egg --dist-dir /tmp/easy_install-dvR53R/MySQL-python-1.2.5/egg-dist-tmp-HHvE06
In file included from /usr/include/mysql/my_config.h:14,
                 from _mysql.c:44:
/usr/include/mysql/my_config_x86_64.h:1082:1: warning: "HAVE_WCSCOLL" redefined
In file included from /usr/include/python2.6/pyconfig.h:6,
                 from /usr/include/python2.6/Python.h:8,
                 from _mysql.c:29:
/usr/include/python2.6/pyconfig-64.h:808:1: warning: this is the location of the previous definition
zip_safe flag not set; analyzing archive contents...
Adding MySQL-python 1.2.5 to easy-install.pth file

Installed /scratch/jcfree/daqarea/env/lib/python2.6/site-packages/MySQL_python-1.2.5-py2.6-linux-x86_64.egg
Searching for django-nose
Reading https://pypi.python.org/simple/django-nose/
Best match: django-nose 1.4.3
Downloading https://pypi.python.org/packages/source/d/django-nose/django-nose-1.4.3.tar.gz#md5=7c884f2de69ad7e5cf5d8ab92765b78e
Processing django-nose-1.4.3.tar.gz
Writing /tmp/easy_install-xNJxz1/django-nose-1.4.3/setup.cfg
Running django-nose-1.4.3/setup.py -q bdist_egg --dist-dir /tmp/easy_install-xNJxz1/django-nose-1.4.3/egg-dist-tmp-Rgj9TW
warning: no previously-included files matching '*.py[co]' found under directory '*'
warning: no previously-included files matching '__pycache__' found under directory '*'
Adding django-nose 1.4.3 to easy-install.pth file

Installed /scratch/jcfree/daqarea/env/lib/python2.6/site-packages/django_nose-1.4.3-py2.6.egg
Searching for Django==1.6.11
Reading https://pypi.python.org/simple/Django/
Best match: Django 1.6.11
Downloading https://pypi.python.org/packages/source/D/Django/Django-1.6.11.tar.gz#md5=3bf6086c3b923876d283dc3404e32fdd
Processing Django-1.6.11.tar.gz
Writing /tmp/easy_install-DNEYGi/Django-1.6.11/setup.cfg
Running Django-1.6.11/setup.py -q bdist_egg --dist-dir /tmp/easy_install-DNEYGi/Django-1.6.11/egg-dist-tmp-HTXFaC
warning: no previously-included files matching '__pycache__' found under directory '*'
warning: no previously-included files matching '*.py[co]' found under directory '*'
zip_safe flag not set; analyzing archive contents...
django.contrib.auth.tests.test_forms: module references __file__
django.contrib.auth.tests.test_views: module references __file__
django.contrib.auth.tests.test_context_processors: module references __file__
django.contrib.admindocs.views: module references __file__
django.contrib.admin.bin.compress: module references __file__
django.contrib.formtools.tests.tests: module references __file__
django.contrib.formtools.tests.wizard.namedwizardtests.tests: module references __file__
django.contrib.formtools.tests.wizard.wizardtests.tests: module references __file__
django.contrib.sitemaps.tests.test_http: module references __file__
django.contrib.gis.tests.geo3d.tests: module references __file__
django.contrib.gis.tests.layermap.tests: module references __file__
django.contrib.gis.tests.geogapp.tests: module references __file__
django.contrib.gis.geometry.test_data: module references __file__
django.contrib.staticfiles.storage: module references __file__
django.contrib.flatpages.tests.test_middleware: module references __file__
django.contrib.flatpages.tests.test_views: module references __file__
django.contrib.flatpages.tests.test_templatetags: module references __file__
django.contrib.flatpages.tests.test_csrf: module references __file__
django.db.utils: module references __file__
django.db.models.loading: module references __file__
django.db.models.loading: module references __path__
django.template.loaders.app_directories: module references __file__
django.core.management.__init__: module references __path__
django.core.management.sql: module references __file__
django.core.management.templates: module references __path__
django.core.management.commands.makemessages: module references __file__
django.conf.project_template.project_name.settings: module references __file__
django.views.i18n: module references __file__
django.utils.version: module references __file__
django.utils.module_loading: module references __path__
django.utils.autoreload: module references __file__
django.utils.six: module references __path__
django.utils.translation.trans_real: module references __file__
django.utils.unittest.collector: module references __file__
django.utils.unittest.loader: module references __file__
django.test._doctest: module references __file__
django.test._doctest: module MAY be using inspect.getsourcefile
Adding Django 1.6.11 to easy-install.pth file
Installing django-admin.py script to /scratch/jcfree/daqarea/env/bin

Installed /scratch/jcfree/daqarea/env/lib/python2.6/site-packages/Django-1.6.11-py2.6.egg
Searching for pytz==2015.7
Reading https://pypi.python.org/simple/pytz/
Best match: pytz 2015.7
Downloading https://pypi.python.org/packages/2.6/p/pytz/pytz-2015.7-py2.6.egg#md5=088ad1e2518643307076d2c03548f0d9
Processing pytz-2015.7-py2.6.egg
Moving pytz-2015.7-py2.6.egg to /scratch/jcfree/daqarea/env/lib/python2.6/site-packages
Adding pytz 2015.7 to easy-install.pth file

Installed /scratch/jcfree/daqarea/env/lib/python2.6/site-packages/pytz-2015.7-py2.6.egg
Searching for pyzmq==14.4.1
Reading https://pypi.python.org/simple/pyzmq/
Best match: pyzmq 14.4.1
Downloading https://pypi.python.org/packages/source/p/pyzmq/pyzmq-14.4.1.zip#md5=0cab6e0047107badf68a0a0fa4ae30d1
Processing pyzmq-14.4.1.zip
Writing /tmp/easy_install-uhHOSY/pyzmq-14.4.1/setup.cfg
Running pyzmq-14.4.1/setup.py -q bdist_egg --dist-dir /tmp/easy_install-uhHOSY/pyzmq-14.4.1/egg-dist-tmp-4letdK
warning: no files found matching 'tools'
no previously-included directories found matching 'docs/build'
no previously-included directories found matching 'docs/gh-pages'
warning: no previously-included files found matching 'bundled/zeromq/src/Makefile*'
warning: no previously-included files found matching 'bundled/zeromq/src/platform.hpp'
warning: no previously-included files found matching 'zmq/libzmq*'
warning: no previously-included files matching '__pycache__/*' found anywhere in distribution
warning: no previously-included files matching '.deps/*' found anywhere in distribution
warning: no previously-included files matching '*.so' found anywhere in distribution
warning: no previously-included files matching '*.pyd' found anywhere in distribution
warning: no previously-included files matching '.git*' found anywhere in distribution
warning: no previously-included files matching '.DS_Store' found anywhere in distribution
warning: no previously-included files matching '.mailmap' found anywhere in distribution
warning: no previously-included files matching 'Makefile.am' found anywhere in distribution
warning: no previously-included files matching 'Makefile.in' found anywhere in distribution
Did not find libzmq via pkg-config:
Package libzmq was not found in the pkg-config search path.
Perhaps you should add the directory containing `libzmq.pc'
to the PKG_CONFIG_PATH environment variable
No package 'libzmq' found

************************************************
Configure: Autodetecting ZMQ settings...
    Custom ZMQ dir:       
build/temp.linux-x86_64-2.6/scratch/tmp/easy_install-uhHOSY/pyzmq-14.4.1/temp/timer_createOt8Vuk.o: In function `main':
timer_createOt8Vuk.c:(.text+0x15): undefined reference to `timer_create'
collect2: ld returned 1 exit status
build/temp.linux-x86_64-2.6/scratch/vers.c:4:17: error: zmq.h: No such file or directory
build/temp.linux-x86_64-2.6/scratch/vers.c: In function ‘main’:
build/temp.linux-x86_64-2.6/scratch/vers.c:8: warning: implicit declaration of function ‘zmq_version’

error: command 'gcc' failed with exit status 1

Failed with default libzmq, trying again with /usr/local
************************************************
Configure: Autodetecting ZMQ settings...
    Custom ZMQ dir:       /usr/local
Assembler messages:
Fatal error: can't create build/temp.linux-x86_64-2.6/scratch/tmp/easy_install-uhHOSY/pyzmq-14.4.1/temp/timer_createQ9wuKb.o: No such file or directory
build/temp.linux-x86_64-2.6/scratch/vers.c:4:17: error: zmq.h: No such file or directory
build/temp.linux-x86_64-2.6/scratch/vers.c: In function ‘main’:
build/temp.linux-x86_64-2.6/scratch/vers.c:8: warning: implicit declaration of function ‘zmq_version’

error: command 'gcc' failed with exit status 1

************************************************
Warning: Failed to build or run libzmq detection test.

If you expected pyzmq to link against an installed libzmq, please check to make sure:

    * You have a C compiler installed
    * A development version of Python is installed (including headers)
    * A development version of ZMQ >= 2.1.4 is installed (including headers)
    * If ZMQ is not in a default location, supply the argument --zmq=<path>
    * If you did recently install ZMQ to a default location,
      try rebuilding the ld cache with `sudo ldconfig`
      or specify zmq's location with `--zmq=/usr/local`

You can skip all this detection/waiting nonsense if you know
you want pyzmq to bundle libzmq as an extension by passing:

    `--zmq=bundled`

I will now try to build libzmq as a Python extension
unless you interrupt me (^C) in the next 10 seconds...

 1...
************************************************
Using bundled libzmq
already have bundled/zeromq
attempting ./configure to generate platform.hpp
Warning: failed to configure libzmq:
/bin/sh: ./configure: No such file or directory

staging platform.hpp from: /tmp/easy_install-uhHOSY/pyzmq-14.4.1/buildutils/include_linux
************************************************
checking for timer_create
build/temp.linux-x86_64-2.6/tmp/easy_install-uhHOSY/pyzmq-14.4.1/temp/timer_createeAb3z_.o: In function `main':
timer_createeAb3z_.c:(.text+0x15): undefined reference to `timer_create'
collect2: ld returned 1 exit status
no timer_create, linking librt
************************************************
Using bundled libsodium
already have bundled/libsodium
already have crypto_scalarmult_curve25519.h
already have crypto_stream_salsa20.h
staging /tmp/easy_install-uhHOSY/pyzmq-14.4.1/buildutils/include_sodium/version.h to bundled/libsodium/src/libsodium/include/sodium/version.h
************************************************
bundled/libsodium/src/libsodium/randombytes/salsa20/randombytes_salsa20_random.c:55: warning: missing braces around initializer
bundled/libsodium/src/libsodium/randombytes/salsa20/randombytes_salsa20_random.c:55: warning: (near initialization for ‘stream.key’)
zip_safe flag not set; analyzing archive contents...
zmq.__init__: module references __file__
zmq.backend.cffi._cffi: module references __file__
Adding pyzmq 14.4.1 to easy-install.pth file

Installed /scratch/jcfree/daqarea/env/lib/python2.6/site-packages/pyzmq-14.4.1-py2.6-linux-x86_64.egg
Searching for pep8==1.5.7
Reading https://pypi.python.org/simple/pep8/
Best match: pep8 1.5.7
Downloading https://pypi.python.org/packages/source/p/pep8/pep8-1.5.7.tar.gz#md5=f6adbdd69365ecca20513c709f9b7c93
Processing pep8-1.5.7.tar.gz
Writing /tmp/easy_install-2ZN8mP/pep8-1.5.7/setup.cfg
Running pep8-1.5.7/setup.py -q bdist_egg --dist-dir /tmp/easy_install-2ZN8mP/pep8-1.5.7/egg-dist-tmp-4Qh0gX
warning: no previously-included files matching '*.pyc' found under directory 'docs'
warning: no previously-included files matching '*.pyo' found under directory 'docs'
warning: no previously-included files matching '*.pyc' found under directory 'testsuite'
warning: no previously-included files matching '*.pyo' found under directory 'testsuite'
no previously-included directories found matching 'docs/_build'
Adding pep8 1.5.7 to easy-install.pth file
Installing pep8 script to /scratch/jcfree/daqarea/env/bin

Installed /scratch/jcfree/daqarea/env/lib/python2.6/site-packages/pep8-1.5.7-py2.6.egg
Searching for nose==1.3.4
Reading https://pypi.python.org/simple/nose/
Best match: nose 1.3.4
Downloading https://pypi.python.org/packages/source/n/nose/nose-1.3.4.tar.gz#md5=6ed7169887580ddc9a8e16048d38274d
Processing nose-1.3.4.tar.gz
Writing /tmp/easy_install-b6gVvE/nose-1.3.4/setup.cfg
Running nose-1.3.4/setup.py -q bdist_egg --dist-dir /tmp/easy_install-b6gVvE/nose-1.3.4/egg-dist-tmp-ptSSlP
no previously-included directories found matching 'doc/.build'
Adding nose 1.3.4 to easy-install.pth file
Installing nosetests-2.6 script to /scratch/jcfree/daqarea/env/bin
Installing nosetests script to /scratch/jcfree/daqarea/env/bin

Installed /scratch/jcfree/daqarea/env/lib/python2.6/site-packages/nose-1.3.4-py2.6.egg
Searching for argparse==1.2.2
Reading https://pypi.python.org/simple/argparse/
Best match: argparse 1.2.2
Downloading https://pypi.python.org/packages/source/a/argparse/argparse-1.2.2.tar.gz#md5=38589b29d9120b19dfca32f86406a1f5
Processing argparse-1.2.2.tar.gz
Writing /tmp/easy_install-6Ghl25/argparse-1.2.2/setup.cfg
Running argparse-1.2.2/setup.py -q bdist_egg --dist-dir /tmp/easy_install-6Ghl25/argparse-1.2.2/egg-dist-tmp-jEcsVn
warning: no previously-included files matching '*.pyc' found anywhere in distribution
warning: no previously-included files matching '*.pyo' found anywhere in distribution
warning: no previously-included files matching '*.orig' found anywhere in distribution
warning: no previously-included files matching '*.rej' found anywhere in distribution
no previously-included directories found matching 'doc/_build'
no previously-included directories found matching 'env24'
no previously-included directories found matching 'env25'
no previously-included directories found matching 'env26'
no previously-included directories found matching 'env27'
zip_safe flag not set; analyzing archive contents...
Adding argparse 1.2.2 to easy-install.pth file

Installed /scratch/jcfree/daqarea/env/lib/python2.6/site-packages/argparse-1.2.2-py2.6.egg
Searching for conttest==0.0.8
Reading https://pypi.python.org/simple/conttest/
Best match: conttest 0.0.8
Downloading https://pypi.python.org/packages/source/c/conttest/conttest-0.0.8.tar.gz#md5=9c5a29213bfa63a1a9156973b232e15f
Processing conttest-0.0.8.tar.gz
Writing /tmp/easy_install-0oSBEO/conttest-0.0.8/setup.cfg
Running conttest-0.0.8/setup.py -q bdist_egg --dist-dir /tmp/easy_install-0oSBEO/conttest-0.0.8/egg-dist-tmp-JSGyWM
zip_safe flag not set; analyzing archive contents...
conttest.conttest: module references __file__
Adding conttest 0.0.8 to easy-install.pth file
Installing conttest script to /scratch/jcfree/daqarea/env/bin

Installed /scratch/jcfree/daqarea/env/lib/python2.6/site-packages/conttest-0.0.8-py2.6.egg
Finished processing dependencies for lbnerc==0.0.0

For nosetests, I found I had to hit "enter" to see the test results ("E" or ".") update on the screen:

(env)bash$ nosetests
...................
.............

.
.
..
.............
.................EEE
======================================================================
ERROR: Failure: ImproperlyConfigured (Requested setting DEFAULT_INDEX_TABLESPACE, but settings are not configured. You must either define the environment variable DJANGO_SETTINGS_MODULE or call settings.configure() before accessing settings.)
----------------------------------------------------------------------
Traceback (most recent call last):
  File "/scratch/jcfree/daqarea/env/lib/python2.6/site-packages/nose-1.3.4-py2.6.egg/nose/loader.py", line 414, in loadTestsFromName
    addr.filename, addr.module)
  File "/scratch/jcfree/daqarea/env/lib/python2.6/site-packages/nose-1.3.4-py2.6.egg/nose/importer.py", line 47, in importFromPath
    return self.importFromDir(dir_path, fqname)
  File "/scratch/jcfree/daqarea/env/lib/python2.6/site-packages/nose-1.3.4-py2.6.egg/nose/importer.py", line 94, in importFromDir
    mod = load_module(part_fqname, fh, filename, desc)
  File "/scratch/jcfree/daqarea/lbnerc/rc/web/control/tests.py", line 2, in <module>
    import rc.web.control.models as models
  File "/scratch/jcfree/daqarea/lbnerc/rc/web/control/models.py", line 2, in <module>
    from django.db import models
  File "/scratch/jcfree/daqarea/env/lib/python2.6/site-packages/Django-1.6.11-py2.6.egg/django/db/models/__init__.py", line 5, in <module>
    from django.db.models.query import Q
  File "/scratch/jcfree/daqarea/env/lib/python2.6/site-packages/Django-1.6.11-py2.6.egg/django/db/models/query.py", line 17, in <module>
    from django.db.models.deletion import Collector
  File "/scratch/jcfree/daqarea/env/lib/python2.6/site-packages/Django-1.6.11-py2.6.egg/django/db/models/deletion.py", line 4, in <module>
    from django.db.models import signals, sql
  File "/scratch/jcfree/daqarea/env/lib/python2.6/site-packages/Django-1.6.11-py2.6.egg/django/db/models/sql/__init__.py", line 4, in <module>
    from django.db.models.sql.subqueries import *
  File "/scratch/jcfree/daqarea/env/lib/python2.6/site-packages/Django-1.6.11-py2.6.egg/django/db/models/sql/subqueries.py", line 12, in <module>
    from django.db.models.sql.query import Query
  File "/scratch/jcfree/daqarea/env/lib/python2.6/site-packages/Django-1.6.11-py2.6.egg/django/db/models/sql/query.py", line 22, in <module>
    from django.db.models.sql import aggregates as base_aggregates_module
  File "/scratch/jcfree/daqarea/env/lib/python2.6/site-packages/Django-1.6.11-py2.6.egg/django/db/models/sql/aggregates.py", line 9, in <module>
    ordinal_aggregate_field = IntegerField()
  File "/scratch/jcfree/daqarea/env/lib/python2.6/site-packages/Django-1.6.11-py2.6.egg/django/db/models/fields/__init__.py", line 116, in __init__
    self.db_tablespace = db_tablespace or settings.DEFAULT_INDEX_TABLESPACE
  File "/scratch/jcfree/daqarea/env/lib/python2.6/site-packages/Django-1.6.11-py2.6.egg/django/conf/__init__.py", line 54, in __getattr__
    self._setup(name)
  File "/scratch/jcfree/daqarea/env/lib/python2.6/site-packages/Django-1.6.11-py2.6.egg/django/conf/__init__.py", line 47, in _setup
    % (desc, ENVIRONMENT_VARIABLE))
ImproperlyConfigured: Requested setting DEFAULT_INDEX_TABLESPACE, but settings are not configured. You must either define the environment variable DJANGO_SETTINGS_MODULE or call settings.configure() before accessing settings.

======================================================================
ERROR: Failure: ImproperlyConfigured (Requested setting DEFAULT_INDEX_TABLESPACE, but settings are not configured. You must either define the environment variable DJANGO_SETTINGS_MODULE or call settings.configure() before accessing settings.)
----------------------------------------------------------------------
Traceback (most recent call last):
  File "/scratch/jcfree/daqarea/env/lib/python2.6/site-packages/nose-1.3.4-py2.6.egg/nose/loader.py", line 414, in loadTestsFromName
    addr.filename, addr.module)
  File "/scratch/jcfree/daqarea/env/lib/python2.6/site-packages/nose-1.3.4-py2.6.egg/nose/importer.py", line 47, in importFromPath
    return self.importFromDir(dir_path, fqname)
  File "/scratch/jcfree/daqarea/env/lib/python2.6/site-packages/nose-1.3.4-py2.6.egg/nose/importer.py", line 94, in importFromDir
    mod = load_module(part_fqname, fh, filename, desc)
  File "/scratch/jcfree/daqarea/lbnerc/rc/web/dbserv/tests.py", line 2, in <module>
    import rc.web.control.models as models
  File "/scratch/jcfree/daqarea/lbnerc/rc/web/control/models.py", line 2, in <module>
    from django.db import models
  File "/scratch/jcfree/daqarea/env/lib/python2.6/site-packages/Django-1.6.11-py2.6.egg/django/db/models/__init__.py", line 5, in <module>
    from django.db.models.query import Q
  File "/scratch/jcfree/daqarea/env/lib/python2.6/site-packages/Django-1.6.11-py2.6.egg/django/db/models/query.py", line 17, in <module>
    from django.db.models.deletion import Collector
  File "/scratch/jcfree/daqarea/env/lib/python2.6/site-packages/Django-1.6.11-py2.6.egg/django/db/models/deletion.py", line 4, in <module>
    from django.db.models import signals, sql
  File "/scratch/jcfree/daqarea/env/lib/python2.6/site-packages/Django-1.6.11-py2.6.egg/django/db/models/sql/__init__.py", line 4, in <module>
    from django.db.models.sql.subqueries import *
  File "/scratch/jcfree/daqarea/env/lib/python2.6/site-packages/Django-1.6.11-py2.6.egg/django/db/models/sql/subqueries.py", line 12, in <module>
    from django.db.models.sql.query import Query
  File "/scratch/jcfree/daqarea/env/lib/python2.6/site-packages/Django-1.6.11-py2.6.egg/django/db/models/sql/query.py", line 22, in <module>
    from django.db.models.sql import aggregates as base_aggregates_module
  File "/scratch/jcfree/daqarea/env/lib/python2.6/site-packages/Django-1.6.11-py2.6.egg/django/db/models/sql/aggregates.py", line 9, in <module>
    ordinal_aggregate_field = IntegerField()
  File "/scratch/jcfree/daqarea/env/lib/python2.6/site-packages/Django-1.6.11-py2.6.egg/django/db/models/fields/__init__.py", line 116, in __init__
    self.db_tablespace = db_tablespace or settings.DEFAULT_INDEX_TABLESPACE
  File "/scratch/jcfree/daqarea/env/lib/python2.6/site-packages/Django-1.6.11-py2.6.egg/django/conf/__init__.py", line 54, in __getattr__
    self._setup(name)
  File "/scratch/jcfree/daqarea/env/lib/python2.6/site-packages/Django-1.6.11-py2.6.egg/django/conf/__init__.py", line 47, in _setup
    % (desc, ENVIRONMENT_VARIABLE))
ImproperlyConfigured: Requested setting DEFAULT_INDEX_TABLESPACE, but settings are not configured. You must either define the environment variable DJANGO_SETTINGS_MODULE or call settings.configure() before accessing settings.

======================================================================
ERROR: Failure: ImproperlyConfigured (Requested setting CACHES, but settings are not configured. You must either define the environment variable DJANGO_SETTINGS_MODULE or call settings.configure() before accessing settings.)
----------------------------------------------------------------------
Traceback (most recent call last):
  File "/scratch/jcfree/daqarea/env/lib/python2.6/site-packages/nose-1.3.4-py2.6.egg/nose/loader.py", line 414, in loadTestsFromName
    addr.filename, addr.module)
  File "/scratch/jcfree/daqarea/env/lib/python2.6/site-packages/nose-1.3.4-py2.6.egg/nose/importer.py", line 47, in importFromPath
    return self.importFromDir(dir_path, fqname)
  File "/scratch/jcfree/daqarea/env/lib/python2.6/site-packages/nose-1.3.4-py2.6.egg/nose/importer.py", line 94, in importFromDir
    mod = load_module(part_fqname, fh, filename, desc)
  File "/scratch/jcfree/daqarea/lbnerc/rc/web/main/tests.py", line 2, in <module>
    from django.test.client import Client
  File "/scratch/jcfree/daqarea/env/lib/python2.6/site-packages/Django-1.6.11-py2.6.egg/django/test/__init__.py", line 5, in <module>
    from django.test.client import Client, RequestFactory
  File "/scratch/jcfree/daqarea/env/lib/python2.6/site-packages/Django-1.6.11-py2.6.egg/django/test/client.py", line 11, in <module>
    from django.contrib.auth import authenticate, login, logout, get_user_model
  File "/scratch/jcfree/daqarea/env/lib/python2.6/site-packages/Django-1.6.11-py2.6.egg/django/contrib/auth/__init__.py", line 6, in <module>
    from django.middleware.csrf import rotate_token
  File "/scratch/jcfree/daqarea/env/lib/python2.6/site-packages/Django-1.6.11-py2.6.egg/django/middleware/csrf.py", line 14, in <module>
    from django.utils.cache import patch_vary_headers
  File "/scratch/jcfree/daqarea/env/lib/python2.6/site-packages/Django-1.6.11-py2.6.egg/django/utils/cache.py", line 26, in <module>
    from django.core.cache import get_cache
  File "/scratch/jcfree/daqarea/env/lib/python2.6/site-packages/Django-1.6.11-py2.6.egg/django/core/cache/__init__.py", line 69, in <module>
    if DEFAULT_CACHE_ALIAS not in settings.CACHES:
  File "/scratch/jcfree/daqarea/env/lib/python2.6/site-packages/Django-1.6.11-py2.6.egg/django/conf/__init__.py", line 54, in __getattr__
    self._setup(name)
  File "/scratch/jcfree/daqarea/env/lib/python2.6/site-packages/Django-1.6.11-py2.6.egg/django/conf/__init__.py", line 47, in _setup
    % (desc, ENVIRONMENT_VARIABLE))
ImproperlyConfigured: Requested setting CACHES, but settings are not configured. You must either define the environment variable DJANGO_SETTINGS_MODULE or call settings.configure() before accessing settings.

----------------------------------------------------------------------
Ran 69 tests in 237.071s

FAILED (errors=3)